{"text_format":"1","workbook":"xlsx","n_sheets":3,"sheets":["Notes Balance","Cumulative Defaults","Collateral Tables "],"not_rendered":{"charts":1,"images":0,"macros":1,"external_links":7,"defined_names":24,"comments":2,"pivot_tables":0},"unopened":[],"bounds":{"document_bytes":16777216,"sheet_cells":100000,"rows_first":2000,"rows_last":500,"rows_between":2000,"halvings":0,"cell_chars":16384,"cell_head_chars":4096},"cells_cut":0,"cells_raw":0,"read":"whole","date_system":"1900"}

{"sheet":"Notes Balance","index":0,"n_rows":89,"n_cols":6,"rows_kept":89,"cut":false,"hidden":false,"merged":[]}
["TOTAL NOTE BALANCES"]
[null,"Total Notes","Class A1 Notes","Class A2 Notes","Class B Notes","Class C Notes"]
["Initial Invested Amount",{"$f":"SUM(C3:F3)","v":408900000},189325000,200000000,10875000,8700000]
["Invested Amount as at Previous Payment Date:  17 August 2020",{"$f":"SUM(C4:F4)","v":408900000},189325000,200000000,10875000,8700000]
["Stated Amount as at Previous Payment Date:  17 August 2020",408900000,189325000,200000000,10875000,8700000]
["Principal Payments to Noteholders on Payment Date",34777204.240000002,34777204.240000002,0,0,0]
["Gross Aggregate Charge-Offs",{"$f":"SUM(C7:G7)","v":0},0,0,0,0]
["Gross Aggregate Reinstatements of charge-offs",0,0,0,0,0]
["Aggregate Charge-Offs for this Collection Period",0,0,0,0,0]
["Reinstatements relating to Charge-offs that have occurred this Collection Period",0,0,0,0,0]
["Aggregate Carry Over Charge-offs not previously reinstated",0,0,0,0,0]
["Reinstatements of Carry Over Charge-offs not previously reinstated",0,0,0,0,0]
["Aggregate Charge-Offs not reinstated and to be carried over to next period",0,0,0,0,0]
["Invested Amount as at Payment Date:  16 November 2020",374122795.75999999,154547795.75999999,200000000,10875000,8700000]
["Stated Amount as at Payment Date:  16 November 2020",374122795.75999999,154547795.75999999,200000000,10875000,8700000]
["Bond Factor at Payment Date:  16 November 2020",null,0.8163094982701703,1,1,1]
["Coupon Margin",null,9.4999999999999998E-3,1.0999999999999999E-2,0,0]
["Coupon Rate (3 month BBSW + margin)",null,1.0499999999999999E-2,1.2E-2,1E-3,1E-3]
["Days in Coupon Period",null,91,91,91,91]
["Coupon Entitlement to be paid out on the current Payment Date: 16 November 2020",null,495616.54,598356.16,2711.3,2169.04]
[]
[]
[]
["TOTAL NOTE BALANCES"]
[null,"Total Notes","Class A1 Notes","Class A2 Notes","Class B Notes","Class C Notes"]
["Initial Invested Amount",{"$f":"SUM(C26:G26)","v":408900000},189325000,200000000,10875000,8700000]
["Invested Amount as at Previous Payment Date:  16 November 2020",{"$f":"SUM(C27:G27)","v":374122795.75999999},154547795.75999999,200000000,10875000,8700000]
["Stated Amount as at Previous Payment Date:  16 November 2020",374122795.75999999,154547795.75999999,200000000,10875000,8700000]
["Principal Payments to Noteholders on Payment Date",28459951.68,28459951.68,0,0,0]
["Gross Aggregate Charge-Offs",0,0,0,0,0]
["Gross Aggregate Reinstatements of charge-offs",0,0,0,0,0]
["Aggregate Charge-Offs for this Collection Period",0,0,0,0,0]
["Reinstatements relating to Charge-offs that have occurred this Collection Period",{"$f":"SUM(C33:G33)","v":0},0,0,0,0]
["Aggregate Carry Over Charge-offs not previously reinstated",0,0,0,0,0]
["Reinstatements of Carry Over Charge-offs not previously reinstated",0,0,0,0,0]
["Aggregate Charge-Offs not reinstated and to be carried over to next period",0,0,0,0,0]
["Invested Amount as at Payment Date:  16 February 2021",345662844.07999998,126087844.07999998,200000000,10875000,8700000]
["Stated Amount as at Payment Date:  16 February 2021",345662844.07999998,126087844.07999998,200000000,10875000,8700000]
["Bond Factor at Payment Date:  16 February 2021",null,0.66598623573220639,1,1,1]
["Coupon Margin",null,9.4999999999999998E-3,1.0999999999999999E-2,0,0]
["Coupon Rate (3 month BBSW + margin)",null,9.7000000000000003E-3,1.12E-2,2.0000000000000001E-4,2.0000000000000001E-4]
["Days in Coupon Period",null,92,92,92,92]
["Coupon Entitlement to be paid out on the current Payment Date: 16 February 2021",null,377858.78,564602.74,548.22,438.58]
[]
[]
[]
["TOTAL NOTE BALANCES"]
[null,"Total Notes","Class A1 Notes","Class A2 Notes","Class B Notes","Class C Notes"]
["Initial Invested Amount",{"$f":"SUM(C49:F49)","v":408900000},189325000,200000000,10875000,8700000]
["Invested Amount as at Previous Payment Date:  16 February 2021",{"$f":"SUM(C50:F50)","v":345662844.07999998},126087844.07999998,200000000,10875000,8700000]
["Stated Amount as at Previous Payment Date:  16 February 2021",345662844.07999998,126087844.07999998,200000000,10875000,8700000]
["Principal Payments to Noteholders on Payment Date",62919663.530000001,62919663.530000001,0,0,0]
["Gross Aggregate Charge-Offs",0,{"$f":"+D53","v":0},0,0,0]
["Gross Aggregate Reinstatements of charge-offs",0,0,0,0,0]
["Aggregate Charge-Offs for this Collection Period",0,0,0,0,0]
["Reinstatements relating to Charge-offs that have occurred this Collection Period",0,0,0,0,0]
["Aggregate Carry Over Charge-offs not previously reinstated",0,0,0,0,0]
["Reinstatements of Carry Over Charge-offs not previously reinstated",0,0,0,0,0]
["Aggregate Charge-Offs not reinstated and to be carried over to next period",{"$f":"SUM(C59:F59)","v":0},0,0,0,0]
["Invested Amount as at Payment Date:  17 May 2021",{"$f":"SUM(C60:F60)","v":282743180.54999995},63168180.549999982,200000000,10875000,8700000]
["Stated Amount as at Payment Date:  17 May 2021",{"$f":"SUM(C61:F61)","v":282743180.54999995},63168180.549999982,200000000,10875000,8700000]
["Bond Factor at Payment Date:  17 May 2021",null,0.33364944170077898,1,1,1]
["Coupon Margin",null,9.4999999999999998E-3,1.0999999999999999E-2,0,0]
["Coupon Rate (3 month BBSW + margin)",null,9.6030000000000004E-3,1.1103E-2,1.03E-4,1.03E-4]
["Days in Coupon Period",null,90,90,90,90]
["Coupon Entitlement to be paid out on the current Payment Date: 17 May 2021",null,298558.74,547545.21,276.2,220.96]
[]
[]
[]
["TOTAL NOTE BALANCES"]
[null,"Total Notes","Class A1 Notes","Class A2 Notes","Class B Notes","Class C Notes"]
["Initial Invested Amount",{"$f":"SUM(C72:G72)","v":408900000},189325000,200000000,10875000,8700000]
["Invested Amount as at Previous Payment Date:  17 May 2021",{"$f":"SUM(C73:G73)","v":282743180.54999995},63168180.549999982,200000000,10875000,8700000]
["Stated Amount as at Previous Payment Date:  17 May 2021",282743180.54999995,63168180.549999982,200000000,10875000,8700000]
["Principal Payments to Noteholders on Payment Date",22830302.510000002,22830302.510000002,0,0,0]
["Gross Aggregate Charge-Offs",{"$f":"SUM(C76:G76)","v":0},0,0,0,0]
["Gross Aggregate Reinstatements of charge-offs",0,0,0,0,0]
["Aggregate Charge-Offs for this Collection Period",0,0,0,0,0]
["Reinstatements relating to Charge-offs that have occurred this Collection Period",{"$f":"SUM(C79:G79)","v":0},0,0,0,0]
["Aggregate Carry Over Charge-offs not previously reinstated",0,0,0,0,0]
{"$rows_left_out":10}
{"sheet":"Cumulative Defaults","index":1,"n_rows":7,"n_cols":4,"rows_kept":7,"cut":false,"hidden":false,"merged":[]}
["Cumulative Defaults & Losses"]
[]
["Month","Gross Losses","Recoveries","Net Losses"]
["2020-10-01",0,0,{"$f":"+B4-C4","v":0}]
["2021-01-01",0,0,{"$f":"+B5-C5","v":0}]
["2021-04-01",4.1450255172413797E-4,0,{"$f":"+B6-C6","v":4.1450255172413797E-4}]
["2021-07-01",{"$f":"+B6+'Collateral Tables '!E9/435000000","v":2.1661076551724137E-3},{"$f":"+C6+'Collateral Tables '!E23/435000000","v":4.4360710344827588E-4},{"$f":"+B7-C7","v":1.7225005517241378E-3}]

{"sheet":"Collateral Tables ","index":2,"n_rows":247,"n_cols":19,"rows_kept":247,"cut":false,"hidden":false,"merged":[]}
[null,"CNHI CAPITAL AUSTRALIA RECEIVABLES TRUST SERIES 2020-1 (TERM DEAL)"]
[null,"COLLATERAL DATA TABLES"]
[]
[null,"OUTSTANDING RECEIVABLES",null,null,"2021-07-31",null,null,null,"2021-04-30",null,null,null,"2021-01-31",null,null,null,"2020-10-31"]
[]
[null,"Opening Balance",null,null,{"$f":"I13","v":308843180.5500015},null,null,null,371762844.08000153,null,null,null,400222795.76000142,null,null,null,434999973.20000142]
[null,"Principal Repayments - Scheduled",null,null,{"$f":"MIN(([2]Sheet1!$B$3+[3]Sheet1!$B$3+[4]Sheet1!$B$3),'[1]16 Aug 21'!$H$23)","v":18901918.629999992},null,null,null,59828601.879999973,null,null,null,25136419.830000006,null,null,null,26305441.499999996]
[null,"Principal Repayments - Unscheduled",null,null,{"$f":"'[1]16 Aug 21'!$H$23-'Collateral Tables '!E7","v":3472716.4100000151},null,null,null,2910753.0400000513,null,null,null,3323531.8499999158,null,null,null,8471735.9399999939]
[{"$f":"SUM(E9:Q9)","v":942256.83},"Charge-Offs",null,null,{"$f":"'[1]16 Aug 21'!$H$37","v":761948.22},null,null,null,180308.61000000002,null,null,null,0,null,null,null,0]
[null,"Reinstatements"]
[null,"New Receivables Purchased"]
[null,"Non Cash Change in Receivables"]
[null,"Closing Balance",null,null,{"$f":"E6-E7-E8-E9+E10+E11-E12","v":285706597.29000145},null,null,null,308843180.5500015,null,null,null,371762844.08000153,null,null,null,400222795.76000142]
[]
[null,"PORTFOLIO STATISTICS"]
[]
[null,"Summary"]
[null,"Number of contracts",null,null,{"$f":"[5]Summary!$B$4","v":3089},null,null,null,3260,null,null,null,3379,null,null,null,3459]
[null,"Dollar value of contracts",null,null,{"$f":"[5]Summary!$B$5","v":285706597.29000068},null,null,null,308843180.5499993,null,null,null,371762844.08000028,null,null,null,400222795.76000023]
[null,"Number of contracts closed during the Quarter",null,null,{"$f":"[5]Summary!$B$19","v":169},null,null,null,118,null,null,null,80,null,null,null,81]
[null,"Dollar value of contracts closed during the Quarter",null,null,{"$f":"[5]Summary!$B$20","v":6346762.1999999993},null,null,null,8489230.9399999958,null,null,null,6207942.7200000016,null,null,null,11089284.780000003]
[]
[{"$f":"SUM(E23:Q23)","v":192969.09},"Dollar Value of Recoveries from Collateral",null,null,{"$f":"[5]Summary!$C$16","v":192969.09},null,null,null,0,null,null,null,0,null,null,null,0]
[{"$f":"SUM(E24:Q24)","v":0},"Dollar Value of Recoveries from Other Sources",null,null,0,null,null,null,0,null,null,null,0,null,null,null,0]
[]
[null,"Average Term of Contracts (Months)",null,null,{"$f":"[6]Sheet1!$W$3091","v":55.739992390288997},null,null,null,55.455838893218491,null,null,null,54.836712581510767,null,null,null,54.458787730372293]
[null,"Average Term to Maturity (Months)",null,null,{"$f":"[6]Sheet1!$X$3091","v":32.574078748533445},null,null,null,34.945628768910865,null,null,null,36.785248881480932,null,null,null,39.320110754577776]
[null,"Average Residual / Balloon Payment *",null,null,{"$f":"[6]Sheet1!$AI$3091","v":3.7181210890735616E-2},null,null,null,3.8809459520592636E-2,null,null,null,3.738139172226735E-2,null,null,null,3.7554148495446298E-2]
[null,"Average Seasoning (Months)",null,null,{"$f":"E26-E27","v":23.165913641755552},null,null,null,20.510210124307626,null,null,null,18.051463700029835,null,null,null,15.138676975794517]
[null,"Average Dollar Value of Individual Assets",null,null,{"$f":"E19/E18","v":92491.614532211286},null,null,null,94737.171947852548,null,null,null,110021.55788102998,null,null,null,115704.76893899978]
[null,"Weighted Average Interest Rate",null,null,{"$f":"[6]Sheet1!$AA$3091/100","v":2.270699088694228E-2},null,null,null,2.2731504735293059E-2,null,null,null,2.2726608213105511E-2,null,null,null,2.2793137532541325E-2]
[]
[null,"Payment in Arrears"]
["1. 0 - 30 Days","0 - 30 Days",null,null,{"$f":"IFERROR(VLOOKUP($A34,'[7]Arrears Reporting'!$A$1:$D$8,3,FALSE),0)","v":3088},{"$f":"IFERROR(VLOOKUP($A34,'[7]Arrears Reporting'!$A$1:$D$8,2,FALSE),0)","v":1243.8200000000038},{"$f":"F34/F$50","v":4.3534871500971666E-6},null,3244,96795.249999999985,3.1341229496349406E-4,null,3368,669139.2699999999,1.7999089490933814E-3,null,3448,608582.11,1.5206083122885025E-3]
["2. 31 - 60 Days","31 - 60 Days",null,null,{"$f":"IFERROR(VLOOKUP($A35,'[7]Arrears Reporting'!$A$1:$D$8,3,FALSE),0)","v":1},{"$f":"IFERROR(VLOOKUP($A35,'[7]Arrears Reporting'!$A$1:$D$8,2,FALSE),0)","v":31314.589999999989},1.0960401438758081E-4,null,10,74360.209999999992,2.4077012115850065E-4,null,3,77257.799999999988,2.0781474327051026E-4,null,8,239593.93000000002,5.9865138252563753E-4]
["3. 61 - 90 Days","61 - 90 Days",null,null,{"$f":"IFERROR(VLOOKUP($A36,'[7]Arrears Reporting'!$A$1:$D$8,3,FALSE),0)","v":0},{"$f":"IFERROR(VLOOKUP($A36,'[7]Arrears Reporting'!$A$1:$D$8,2,FALSE),0)","v":0},0,null,2,37814.990000000005,1.224407478664664E-4,null,4,131816.78000000003,3.5457222823385265E-4,null,2,134580.25,3.3626332988964257E-4]
["4. 91 - 120 Days","91 - 120 Days",null,null,{"$f":"IFERROR(VLOOKUP($A37,'[7]Arrears Reporting'!$A$1:$D$8,3,FALSE),0)","v":0},{"$f":"IFERROR(VLOOKUP($A37,'[7]Arrears Reporting'!$A$1:$D$8,2,FALSE),0)","v":0},0,null,2,115620.04999999999,3.7436491164901097E-4,null,2,41551.660000000003,1.1176926543809858E-4,null,1,5840.8499999999985,1.459399629875794E-5]
["5. 121 - 150 Days","121 - 150 Days",null,null,{"$f":"IFERROR(VLOOKUP($A38,'[7]Arrears Reporting'!$A$1:$D$8,3,FALSE),0)","v":0},{"$f":"IFERROR(VLOOKUP($A38,'[7]Arrears Reporting'!$A$1:$D$8,2,FALSE),0)","v":0},0,null,0,0,0,null,2,3518.8499999999995,9.4653084783340328E-6,null,0,0,0]
["6. 151 - 180 Days","151 - 180 Days",null,null,{"$f":"IFERROR(VLOOKUP($A39,'[7]Arrears Reporting'!$A$1:$D$8,3,FALSE),0)","v":0},{"$f":"IFERROR(VLOOKUP($A39,'[7]Arrears Reporting'!$A$1:$D$8,2,FALSE),0)","v":0},0,null,2,122531.52000000002,3.9674348574506789E-4,null,0,0,0,null,0,0,0]
[null,"Total",null,null,{"$f":"SUM(E34:E39)","v":3089},{"$f":"SUM(F34:F39)","v":32558.409999999993},{"$f":"SUM(G34:G39)","v":1.1395750153767797E-4},null,3260,447122.01999999996,1.4477315613825399E-3,null,3379,923284.35999999987,2.4835304945141769E-3,null,3459,988597.14,2.4701170210025408E-3]
[null,"* Expressed as a % of Aggreg. Rec. closing bal.",null,null,null,"> 30 days",{"$f":"SUM(G35:G39)","v":1.0960401438758081E-4},null,null,"> 30 days",1.1343192664190458E-3,null,null,"> 30 days",6.8362154542079548E-4,null,null,"> 30 days",9.4950870871403803E-4]
[]
[" 0 - 30 Days","Account Balances in Arrears"]
["1. 0 - 30 Days","0 - 30 Days",null,null,{"$f":"IFERROR(VLOOKUP($A44,'[7]Arrears Reporting'!$A$1:$D$8,3,FALSE),0)","v":3088},{"$f":"IFERROR(VLOOKUP($A44,'[7]Arrears Reporting'!$A$1:$D$8,4,FALSE),0)","v":285598376.65000069},{"$f":"F44/F$50","v":0.99962121756715983},null,3244,306751454.69999921,0.99322722345277326,null,3368,370345507.02000022,0.99618752362542429,null,3448,398525593.33000022,0.99575935591880238]
["2. 31 - 60 Days","31 - 60 Days",null,null,{"$f":"IFERROR(VLOOKUP($A45,'[7]Arrears Reporting'!$A$1:$D$8,3,FALSE),0)","v":1},{"$f":"IFERROR(VLOOKUP($A45,'[7]Arrears Reporting'!$A$1:$D$8,4,FALSE),0)","v":108220.64},{"$f":"F45/F$50","v":3.787824328401939E-4},null,10,955937.27,3.0952189661356037E-3,null,3,457915.85,1.231741841047085E-3,null,8,1107284.19,2.7666694694322208E-3]
["3. 61 - 90 Days","61 - 90 Days",null,null,{"$f":"IFERROR(VLOOKUP($A46,'[7]Arrears Reporting'!$A$1:$D$8,3,FALSE),0)","v":0},{"$f":"IFERROR(VLOOKUP($A46,'[7]Arrears Reporting'!$A$1:$D$8,4,FALSE),0)","v":0},0,null,2,219395.31,7.1037770563459697E-4,null,4,653099.60000000009,1.756764051061161E-3,null,2,543586.31000000006,1.3582092668353904E-3]
["4. 91 - 120 Days","91 - 120 Days",null,null,{"$f":"IFERROR(VLOOKUP($A47,'[7]Arrears Reporting'!$A$1:$D$8,3,FALSE),0)","v":0},{"$f":"IFERROR(VLOOKUP($A47,'[7]Arrears Reporting'!$A$1:$D$8,4,FALSE),0)","v":0},{"$f":"F47/F$50","v":0},null,2,348198.83,1.1274292324665058E-3,null,2,222711.15999999997,5.9906782925319552E-4,null,1,46331.93,1.1576534492998659E-4]
["5. 121 - 150 Days","121 - 150 Days",null,null,{"$f":"IFERROR(VLOOKUP($A48,'[7]Arrears Reporting'!$A$1:$D$8,3,FALSE),0)","v":0},{"$f":"IFERROR(VLOOKUP($A48,'[7]Arrears Reporting'!$A$1:$D$8,4,FALSE),0)","v":0},{"$f":"F48/F$50","v":0},null,0,0,0,null,2,83610.45,2.2490265321406817E-4,null,0,0,0]
["6. 151 - 180 Days","151 - 180 Days",null,null,{"$f":"IFERROR(VLOOKUP($A49,'[7]Arrears Reporting'!$A$1:$D$8,3,FALSE),0)","v":0},{"$f":"IFERROR(VLOOKUP($A49,'[7]Arrears Reporting'!$A$1:$D$8,4,FALSE),0)","v":0},{"$f":"F49/F$50","v":0},null,2,568194.43999999994,1.8397506429902017E-3,null,0,0,0,null,0,0,0]
[null,"Total",null,null,{"$f":"SUM(E44:E49)","v":3089},{"$f":"SUM(F44:F49)","v":285706597.29000068},{"$f":"SUM(G44:G49)","v":1},null,3260,308843180.54999918,1.0000000000000002,null,3379,371762844.08000028,0.99999999999999989,null,3459,400222795.76000023,1]
["NSW",null,null,null,null,"> 30 days",{"$f":"SUM(G45:G49)","v":3.787824328401939E-4},null,null,"> 30 days",6.7727765472269091E-3,null,null,"> 30 days",3.8124763745755099E-3,null,null,"> 30 days",4.2406440811975981E-3]
[null,null,null,null,null,"> 60 days",{"$f":"SUM(G46:G49)","v":0},null,null,"> 60 days",3.6775575810913045E-3,null,null,"> 60 days",2.5807345335284249E-3,null,null,"> 60 days",1.4739746117653769E-3]
[null,null,null,null,null,">90 days",{"$f":"SUM(G47:G49)","v":0},null,null,">90 days",2.9671798754567075E-3,null,null,">90 days",8.2397048246726366E-4,null,null,">90 days",1.1576534492998659E-4]
[]
["VIC","Geographic Distribution"]
["NSW","New South Wales",null,null,{"$f":"F56/F$64","v":0.24627373986950885},{"$f":"IFERROR(VLOOKUP($A56,'[7]Geographic '!$A$1:$C$10,3,FALSE),0)","v":70362032.219999984},null,null,0.24998360631602445,77205732.060000047,null,null,0.24533885742592679,91207871.400000185,null,null,0.24685968916984516,98798874.960000023]
["VIC","Victoria",null,null,{"$f":"F57/F$64","v":0.2171302887592485},{"$f":"IFERROR(VLOOKUP($A57,'[7]Geographic '!$A$1:$C$10,3,FALSE),0)","v":62035555.970000029},null,null,0.22236335990226544,68675407.309999987,null,null,0.21677229686422927,80587885.599999949,null,null,0.21323032049672458,85339635.009999946]
["QLD","Queensland",null,null,0.11230010435297356,{"$f":"IFERROR(VLOOKUP($A58,'[7]Geographic '!$A$1:$C$10,3,FALSE),0)","v":32084880.689999998},null,null,0.11639922868292057,35949107.99999997,null,null,0.10566504901051051,39282339.139999978,null,null,0.10911006482545886,43668335.189999983]
["SA","South Australia",null,null,0.20569304985403983,{"$f":"IFERROR(VLOOKUP($A59,'[7]Geographic '!$A$1:$C$10,3,FALSE),0)","v":58767861.360000052},null,null,0.19970919351419694,61678822.510000005,null,null,0.20647734487818203,76760604.969999984,null,null,0.2000584061883722,80067934.640000001]
["NT","Northern Territory",null,null,0,{"$f":"IFERROR(VLOOKUP($A60,'[7]Geographic '!$A$1:$C$10,3,FALSE),0)","v":0},null,null,0,0,null,null,0,0,null,null,0,0]
["ACT","Australian Capital Territory",null,null,1.2712366583237885E-3,{"$f":"IFERROR(VLOOKUP($A61,'[7]Geographic '!$A$1:$C$10,3,FALSE),0)","v":363200.7},null,null,1.2329193065616485E-3,380778.72,null,null,1.2097697689853544E-3,449747.44999999995,null,null,1.1397817036727404E-3,456166.62]
["TAS","Tasmania",null,null,1.6410803441269037E-2,{"$f":"IFERROR(VLOOKUP($A62,'[7]Geographic '!$A$1:$C$10,3,FALSE),0)","v":4688674.8099999996},null,null,1.7221919358970286E-2,5318872.3499999996,null,null,1.5713687591498264E-2,5841765.1900000004,null,null,1.5793035821453624E-2,6320732.9499999974]
["WA","Western Australia",null,null,0.20092077706463649,{"$f":"IFERROR(VLOOKUP($A63,'[7]Geographic '!$A$1:$C$10,3,FALSE),0)","v":57404391.539999969},null,null,0.19308977291906076,59634459.599999979,null,null,0.20882299446066782,77632630.329999968,null,null,0.21380870179447287,85571116.39000006]
[null,"Total",null,null,{"$f":"SUM(E56:E63)","v":1},{"$f":"SUM(F56:F63)","v":285706597.29000002},null,null,1.0000000000000002,308843180.54999995,null,null,1,371762844.08000004,null,null,1,400222795.75999999]
["AG",null,null,null,null,null,{"$f":"E13-F64","v":1.430511474609375E-6},null,null,null,1.5497207641601563E-6,null,null,null,1.4901161193847656E-6,null,null,null,1.430511474609375E-6]
["CE","Top Industry Distribution"]
["AGRICULTURAL MACHINERY","Agricultural",null,null,{"$f":"F67/F$70","v":0.96428655429456855},{"$f":"IFERROR(VLOOKUP($A$67,'[7]Top Industry'!$A$1:$C$4,3,FALSE),)","v":275503030.24000055},null,null,0.96144750394424727,296936505.04999989,null,null,0.96306499700372106,358031782.32000077,null,null,0.96151115188042091,384818681.36000061]
["CONSTRUCTION EQUIPMENT","Construction",null,null,{"$f":"F68/F$70","v":3.5713445705431439E-2},{"$f":"IFERROR(VLOOKUP($A$68,'[7]Top Industry'!$A$1:$C$4,3,FALSE),)","v":10203567.050000001},null,null,3.8552496055752748E-2,11906675.500000004,null,null,3.6935002996278908E-2,13731061.759999996,null,null,3.848884811957913E-2,15404114.4]
["MOTOR VEHICLE - AG","Motor Vehicle AG",null,null,{"$f":"F69/F$70","v":0},{"$f":"IFERROR(VLOOKUP($A$69,'[7]Top Industry'!$A$1:$C$4,3,FALSE),)","v":0},null,null,0,0,null,null,0,0,null,null,0,0]
[null,"Total",null,null,{"$f":"SUM(E67:E69)","v":1},{"$f":"SUM(F67:F69)","v":285706597.29000056},{"$f":"F64-F70","v":-5.3644180297851563E-7},null,1,308843180.54999989,0,null,1,371762844.08000076,-7.152557373046875E-7,null,1,400222795.76000059,-5.9604644775390625E-7]
["COMBINE"]
["40-100 HP TRACTOR","Collateral Types"]
["100<140 HP TRACTOR","100<140 HP TRACTOR",null,null,{"$f":"IFERROR(F73/F$111,0)","v":0.10271496310675897},{"$f":"IFERROR(VLOOKUP($A73,[7]Collateral!$A$1:$C$35,3,FALSE),\"\")","v":29346342.600000005},null,null,0.10616665409807113,32788847.11999999,null,null,9.97148357892991E-2,37070270.950000003,null,null,0.10041685507614133,40189114.480000019]
["4 EWD TRACTORS","4 EWD TRACTORS",null,null,0.10174142895445622,{"$f":"IFERROR(VLOOKUP($A74,[7]Collateral!$A$1:$C$35,3,FALSE),\"\")","v":29068197.469999984},null,null,9.9566226572458408E-2,30750350.089999989,null,null,9.9741663833464389E-2,37080244.619999997,null,null,9.7749299351403862E-2,39121497.869999997]
["40<60 HP TRACTOR","40<60 HP TRACTOR",null,null,9.6395889913753613E-3,{"$f":"IFERROR(VLOOKUP($A75,[7]Collateral!$A$1:$C$35,3,FALSE),\"\")","v":2754094.169999999},null,null,1.0002692448959108E-2,3089263.35,null,null,9.6298466805079998E-3,3580019.1900000009,null,null,9.7833235424900616E-3,3915509.0999999982]
["4WD Vehicle","4WD Vehicle",null,null,3.2963121920634858E-3,{"$f":"IFERROR(VLOOKUP($A76,[7]Collateral!$A$1:$C$35,3,FALSE),\"\")","v":941778.1399999999},null,null,3.0493732719720228E-3,941778.1399999999,null,null,3.1278335597996801E-3,1162812.2999999998,null,null,2.9054124660537806E-3,1162812.2999999998]
["60<100 HP TRACTOR","60<100 HP TRACTOR",null,null,4.7623358190042854E-2,{"$f":"IFERROR(VLOOKUP($A77,[7]Collateral!$A$1:$C$35,3,FALSE),\"\")","v":13606307.620000003},null,null,4.9007206450361086E-2,15135541.509999998,null,null,4.5031988313488994E-2,16741220.049999991,null,null,4.6006634867049409E-2,18412904.030000005]
["BACKHOE","BACKHOE",null,null,1.1027340740060233E-4,{"$f":"IFERROR(VLOOKUP($A78,[7]Collateral!$A$1:$C$35,3,FALSE),\"\")","v":31505.840000000011},null,null,3.4264917169789174E-4,105824.85999999996,null,null,3.2529843131385157E-4,120933.86999999998,null,null,3.622858606158672E-4,144995.06]
["BALERS, WINDROWERS, MOWERS, RAKES","BALERS, WINDROWERS, MOWERS, RAKES",null,null,4.065597693640155E-2,{"$f":"IFERROR(VLOOKUP($A79,[7]Collateral!$A$1:$C$35,3,FALSE),\"\")","v":11615680.830000011},null,null,4.0991785887758647E-2,12660033.529999988,null,null,4.0858043055887951E-2,15189502.289999997,null,null,4.0605957487102856E-2,16251429.830000004]
["COMBINES","COMBINES",null,null,0.31151667295823821,{"$f":"IFERROR(VLOOKUP($A80,[7]Collateral!$A$1:$C$35,3,FALSE),\"\")","v":89002368.63000004},null,null,0.30539115988261389,94317977.13000007,null,null,0.32456910520093429,120662733.65000005,null,null,0.32708290993624445,130906036.66]
{"$rows_left_out":167}